{"text_format":"1","workbook":"xlsx","n_sheets":8,"sheets":["Hauptseite - main page","Bestellhilfe - ordering guide","Zusammenfassung - summary","Überblick - overview","Tabelle1","Comments","Bilder","Tabelle2"],"not_rendered":{"charts":0,"images":86,"macros":1,"external_links":1,"defined_names":67,"comments":2,"pivot_tables":0},"unopened":[],"bounds":{"document_bytes":16777216,"sheet_cells":100000,"rows_first":2000,"rows_last":500,"rows_between":2000,"halvings":0,"cell_chars":16384,"cell_head_chars":4096},"cells_cut":0,"cells_raw":0,"read":"whole","date_system":"1900"}

{"sheet":"Hauptseite - main page","index":0,"n_rows":221,"n_cols":11,"rows_kept":221,"cut":false,"hidden":false,"merged":[[2,6,2,8],[1,6,1,8],[3,6,3,8],[49,7,49,9],[23,1,23,5],[49,1,49,5],[27,8,30,10],[7,2,7,6],[8,2,8,6],[8,8,13,13],[10,2,10,6],[11,2,11,6],[13,2,13,6]]}
[]
["SmartHandle AX -",null,null,null,null,null,"Sprache / language / langue / lingua / taal / sprog / språk"]
[{"$f":"HLOOKUP(G3,A207:G227,13,0)","v":"Bestell-Leitfaden"},null,null,null,null,null,"Deutsch"]
[null,null,null,null,null,null,{"$f":"'Bestellhilfe - ordering guide'!H236","v":"*** Bitte Makros aktivieren ***"}]
[]
[]
[]
[{"$f":"'Bestellhilfe - ordering guide'!A12","v":"Kundennummer"},null,null,null,null,null,null,null,{"$f":"HLOOKUP(G3,A207:G227,14,0)","v":"abweichende Lieferanschrift"}]
[{"$f":"'Bestellhilfe - ordering guide'!E12","v":"Kundenname"}]
[]
[{"$f":"'Bestellhilfe - ordering guide'!L12","v":"Projekt-Nr.  "}]
[{"$f":"'Bestellhilfe - ordering guide'!A14","v":"Projekt-Name  "}]
[]
[{"$f":"'Bestellhilfe - ordering guide'!E14","v":"Anlage zu Bestellnummer  "}]
[]
[]
[]
[]
[]
[{"$f":"HLOOKUP(G3,A207:G227,2,0)","v":"Was möchten Sie bestellen?"}]
{"$rows_left_out":202}
{"sheet":"Bestellhilfe - ordering guide","index":1,"n_rows":733,"n_cols":143,"rows_kept":733,"cut":false,"hidden":true,"merged":[[132,7,132,8],[110,7,110,8],[26,0,26,10],[13,1,13,2],[1,7,1,10],[11,6,11,7],[3,7,3,10],[2,0,2,6],[5,7,5,10],[5,5,5,6],[8,3,8,5],[27,0,27,10],[28,0,28,10],[6,13,6,14],[7,13,7,14],[8,13,8,14],[13,4,13,5],[13,6,13,9],[11,11,11,13],[11,4,11,5]]}
[" "]
[]
[{"$f":"HLOOKUP($I$3,A234:G302,2,0)","v":"Bestellhilfe Digitales SmartHandle - AX"},null,null,null,null,null,null,null,{"$f":"'Hauptseite - main page'!G3","v":"Deutsch"}]
[]
[null,null,null,null,null,null,null,null,null,null,null,null,null,null,null,null,"Stand: 09 / 2020"]
[null,null,{"$f":"HLOOKUP($I$3,A234:G302,47,0)","v":"zur Ansicht des SmartHandles bitte die gelb markierten Felder aus dem Drop-Down Menü auswählen"},null,{"$f":"J351","v":"Außenseite"},{"$f":"J352","v":"Innenseite"},null,{"$f":"HLOOKUP($I$3,$A$234:$G$310,4,0)","v":"Drückervariante auswählen"},null,null,null,null,null,null,{"$f":"I360","v":"Bemaßungen"},"Cover"]
[null,{"$f":"HLOOKUP($I$3,A234:G302,12,0)","v":"Profil"},null,null,null,null,null,null,"E."]
[null,{"$f":"F16","v":"Außenrosette"}]
[null,{"$f":"G16","v":"Innenrosette"},null," ",null,null,null,null,null,null,null,null,null,null,null,null,null,null,null,"Druckverbot \"T10\""]
[null,null,null,null,null,null,null,null,null,null,null,null,null,null,null,null,null,null,null,0]
[]
[{"$f":"HLOOKUP($I$3,A234:G302,5,0)","v":"Kundennummer"},4711,null,null,{"$f":"HLOOKUP($I$3,A234:G302,6,0)","v":"Kundenname"},null,"Ich AG",null,null,null,null,{"$f":"HLOOKUP($I$3,A234:G302,7,0)","v":"Projekt-Nr.  "},null,null,"17-15145"]
[]
[{"$f":"HLOOKUP($I$3,A234:G302,8,0)","v":"Projekt-Name  "},"Kölnisch Wasser",null,null,{"$f":"HLOOKUP($I$3,A234:G302,9,0)","v":"Anlage zu Bestellnummer  "},null,"Testbestellung Kerstin Horvat"]
[]
[{"$f":"HLOOKUP(I3,A234:G302,10,0)","v":"Anzahl"},{"$f":"HLOOKUP($I$3,A234:G334,11,0)","v":"Produktname"},"Sondervarianten (bei Bedarf bitte Button klicken)",{"$f":"I370","v":"Brandschutz / Fluchttüren / PAS24"},{"$f":"HLOOKUP($I$3,A234:G302,12,0)","v":"Profil"},{"$f":"I247","v":"Außenrosette"},{"$f":"I291","v":"Innenrosette"},{"$f":"HLOOKUP($I$3,A234:G302,19,0)","v":"Drücker außen"},{"$f":"HLOOKUP($I$3,A234:G302,20,0)","v":"Drücker innen"},{"$f":"HLOOKUP($I$3,A234:G302,21,0)","v":"Oberfläche"},{"$f":"HLOOKUP($I$3,A234:G302,15,0)","v":"Türdicke (mm)"},{"$f":"HLOOKUP($I$3,A234:G302,16,0)","v":"Vierkant (mm)"},{"$f":"HLOOKUP($I$3,A234:G302,22,0)","v":"Lesetechnik"},"Optionen",{"$f":"HLOOKUP($I$3,A234:G302,24,0)","v":"kpl. Artikelnummer"},{"$f":"HLOOKUP($I$3,A234:G302,25,0)","v":"Artikelnummer korrekt?"},{"$f":"I284","v":"Bemerkungen"},null,"Wenn FSB-Drücker, dann Adapter","Produktname","Profil / Montage",null,"Außen-rosette","Innen-rosette",null,"Drücker außen","Drücker innen",null,"Ober-fläche",null,"Tür-dicke",null,"Vierkant",null,"Lese-technik",null,"G2","Optionen","Panik","Brandschutz",null,"Langtext",null,null,null,"wenn Panikstangen",null,null,"wenn Bemerkung gefüllt",null,null,null,"wenn FH",null,"wenn DS"]
[null,null,null,null,null,null,null,null,null,null,null,"",null,null,{"$f":"IF(P17=$B$279,T17&U17&V17&W17&X17&Y17&Z17&AA17&AB17&AC17&AD17&AE17&AF17&AG17&AH17&AI17&AJ17&AK17&AL17&VLOOKUP(D17,$A$148:$D$152,4,FALSE)&AM17,\"\")","v":""},{"$f":"IF(AND(A17<>\"\",B17<>\"\",E17<>\"\",F17<>\"\",G17<>\"\",H17<>\"\",I17<>\"\",J17<>\"\",K17<>\"\",L17<>\"\",M17<>\"\",N17<>\"\"),$B$279,$A$279)","v":"Î"},{"$f":"IF(S17=1,$I$259,IF(AT17=1,$I$318,IF(D17=$I$382,$I$384,\"\")))","v":""},{"$f":"IF(AND(P17=$A$279,B17<>\"\"),1,0)","v":0},{"$f":"IF(H17=$I$308,1,0)","v":0},{"$f":"IF(B17<>\"\",VLOOKUP(B17,$B$34:$D$35,3,FALSE),\"\")","v":""},{"$f":"IF(E17<>\"\",VLOOKUP(E17,$A$44:$B$53,2,FALSE),\"\")","v":""},{"$f":"IF(U17<>\"\",\".\",\"\")","v":""},{"$f":"IF(F17<>\"\",VLOOKUP(F17,$H$97:$I$99,2,FALSE),\"\")","v":""},{"$f":"IF(G17<>\"\",VLOOKUP(G17,$H$97:$I$100,2,FALSE),\"\")","v":""},{"$f":"IF(X17<>\"\",\".\",\"\")","v":""},{"$f":"IF(H17<>\"\",VLOOKUP(H17,$H$85:$I$90,2,FALSE),\"\")","v":""},{"$f":"IF(I17<>\"\",VLOOKUP(I17,$H$85:$I$91,2,FALSE),\"\")","v":""},{"$f":"IF(AA17<>\"\",\".\",\"\")","v":""},{"$f":"IF(J17<>\"\",VLOOKUP(J17,$A$97:$B$99,2,FALSE),\"\")","v":""},{"$f":"IF(AC17<>\"\",\".\",\"\")","v":""},{"$f":"IF(K17<>\"\",VLOOKUP(K17,$A$85:$B$92,2,FALSE),\"\")","v":""},null,{"$f":"IF(L17<>\"\",L17,\"\")","v":""},{"$f":"IF(AG17<>\"\",\".\",\"\")","v":""},{"$f":"IF(M17<>\"\",VLOOKUP(M17,$K$85:$L$88,2,FALSE),\"\")","v":""},{"$f":"IF(AK17<>\"\",\".\",\"\")","v":""},{"$f":"IF(AND(M17<>\"\",M17<>$I$316),\"G2\",\"\")","v":""},{"$f":"IF(AND($N17<>\"\",$N17<>$J$340,$N17<>$J$341),$N17,\"\")","v":""},{"$f":"IF(B186<>\"\",\".P\"&VLOOKUP(C17,B186:C186,2,FALSE),\"\")","v":""},{"$f":"IF(D17<>A148,\", \"&D17,\"\")","v":", "},null,{"$f":"IF(P17=$B$279,(VLOOKUP(B17,$B$34:$C$35,2,FALSE)&VLOOKUP(U17,$N$157:$O$184,2,FALSE)&AN17&\", \"&J17&\", \"&M17&VLOOKUP(N17,$D$97:$E$103,2,FALSE)),\"\")","v":""},null,null,null,{"$f":"IF(OR(C186=1,C186=2),1,0)","v":0},null,null,{"$f":"IF(Q17<>\"\",1,\"\")","v":""},null,null,null,{"$f":"IF(OR(D17=$C$199,D17=$C$201)*AND(E17<>$A$179),1,0)","v":0}]
[null,null,null,null,null,null,null,null,null,null,null,"",null,null,{"$f":"IF(P18=$B$279,T18&U18&V18&W18&X18&Y18&Z18&AA18&AB18&AC18&AD18&AE18&AF18&AG18&AH18&AI18&AJ18&AK18&AL18&VLOOKUP(D18,$A$148:$D$152,4,FALSE)&AM18,\"\")","v":""},{"$f":"IF(AND(A18<>\"\",B18<>\"\",E18<>\"\",F18<>\"\",G18<>\"\",H18<>\"\",I18<>\"\",J18<>\"\",K18<>\"\",L18<>\"\",M18<>\"\",N18<>\"\"),$B$279,$A$279)","v":"Î"},{"$f":"IF(S18=1,$I$259,IF(AT18=1,$I$318,IF(D18=$I$382,$I$384,\"\")))","v":""},{"$f":"IF(AND(P18=$A$279,B18<>\"\"),1,0)","v":0},0,"",{"$f":"IF(E18<>\"\",VLOOKUP(E18,$A$44:$B$53,2,FALSE),\"\")","v":""},{"$f":"IF(U18<>\"\",\".\",\"\")","v":""},{"$f":"IF(F18<>\"\",VLOOKUP(F18,$H$97:$I$99,2,FALSE),\"\")","v":""},{"$f":"IF(G18<>\"\",VLOOKUP(G18,$H$97:$I$100,2,FALSE),\"\")","v":""},{"$f":"IF(X18<>\"\",\".\",\"\")","v":""},{"$f":"IF(H18<>\"\",VLOOKUP(H18,$H$85:$I$90,2,FALSE),\"\")","v":""},{"$f":"IF(I18<>\"\",VLOOKUP(I18,$H$85:$I$91,2,FALSE),\"\")","v":""},{"$f":"IF(AA18<>\"\",\".\",\"\")","v":""},{"$f":"IF(J18<>\"\",VLOOKUP(J18,$A$97:$B$99,2,FALSE),\"\")","v":""},{"$f":"IF(AC18<>\"\",\".\",\"\")","v":""},{"$f":"IF(K18<>\"\",VLOOKUP(K18,$A$85:$B$92,2,FALSE),\"\")","v":""},null,{"$f":"IF(L18<>\"\",L18,\"\")","v":""},{"$f":"IF(AG18<>\"\",\".\",\"\")","v":""},{"$f":"IF(M18<>\"\",VLOOKUP(M18,$K$85:$L$88,2,FALSE),\"\")","v":""},{"$f":"IF(AK18<>\"\",\".\",\"\")","v":""},{"$f":"IF(AND(M18<>\"\",M18<>$I$316),\"G2\",\"\")","v":""},"",{"$f":"IF(B187<>\"\",\".P\"&VLOOKUP(C18,B187:C187,2,FALSE),\"\")","v":""},{"$f":"IF(D18<>A149,\", \"&D18,\"\")","v":", "},null,{"$f":"IF(P18=$B$279,(VLOOKUP(B18,$B$34:$C$35,2,FALSE)&VLOOKUP(U18,$N$157:$O$184,2,FALSE)&AN18&\", \"&J18&\", \"&M18&VLOOKUP(N18,$D$97:$E$103,2,FALSE)),\"\")","v":""},null,null,null,{"$f":"IF(OR(C187=1,C187=2),1,0)","v":0},null,null,{"$f":"IF(Q18<>\"\",1,\"\")","v":""},null,null,null,{"$f":"IF(OR(D18=$C$199,D18=$C$201)*AND(E18<>$A$179),1,0)","v":0}]
[null,null,null,null,null,null,null,null,null,null,null,"",null,null,"","Î","",0,0,"","","","","","","","","","","","",null,"","","","","","",{"$f":"IF(B188<>\"\",\".P\"&VLOOKUP(C19,B188:C188,2,FALSE),\"\")","v":""},", ",null,"",null,null,null,0,null,null,"",null,null,null,0]
[null,null,null,null,null,null,null,null,null,null,null,"",null,null,"","Î","",0,0,"","","","","","","","","","","","",null,"","","","","","",{"$f":"IF(B189<>\"\",\".P\"&VLOOKUP(C20,B189:C189,2,FALSE),\"\")","v":""},", ",null,"",null,null,null,0,null,null,"",null,null,null,0]
{"$rows_left_out":714}
{"sheet":"Zusammenfassung - summary","index":2,"n_rows":31,"n_cols":34,"rows_kept":31,"cut":false,"hidden":true,"merged":[[17,1,17,2],[1,0,1,2],[16,0,16,2],[10,0,10,1],[12,0,12,1],[6,0,6,1],[7,0,7,1],[9,0,9,1]]}
[]
[{"$f":"HLOOKUP('Bestellhilfe - ordering guide'!I3,'Bestellhilfe - ordering guide'!A234:G284,49,FALSE)","v":"Zusammenfassung der Bestellung"},null,null,null,null,{"$f":"'Bestellhilfe - ordering guide'!I3:I3","v":"Deutsch"}]
[null,null,null,null,null,{"$f":"'Bestellhilfe - ordering guide'!I283","v":"zurück zur Hauptseite"}]
[]
[]
[]
[{"$f":"'Bestellhilfe - ordering guide'!A12","v":"Kundennummer"},null,{"$f":"IF('Hauptseite - main page'!C8<>\"\",'Hauptseite - main page'!C8,\"\")","v":""}]
[{"$f":"'Bestellhilfe - ordering guide'!E12","v":"Kundenname"},null,{"$f":"IF('Hauptseite - main page'!C9<>\"\",'Hauptseite - main page'!C9,\"\")","v":""}]
[]
[{"$f":"'Bestellhilfe - ordering guide'!L12","v":"Projekt-Nr.  "},null,{"$f":"IF('Hauptseite - main page'!C11<>\"\",'Hauptseite - main page'!C11,\"\")","v":""}]
[{"$f":"'Bestellhilfe - ordering guide'!A14","v":"Projekt-Name  "},null,{"$f":"IF('Hauptseite - main page'!C12<>\"\",'Hauptseite - main page'!C12,\"\")","v":""}]
[]
[{"$f":"'Bestellhilfe - ordering guide'!E14","v":"Anlage zu Bestellnummer  "},null,{"$f":"IF('Hauptseite - main page'!C14<>\"\",'Hauptseite - main page'!C14,\"\")","v":""}]
[]
[null,null,{"$f":"IF('Hauptseite - main page'!I9<>\"\",'Hauptseite - main page'!I8,\"\")","v":""}]
[{"$f":"'Bestellhilfe - ordering guide'!I259","v":" (*) Zusatz-\nInformation"},null,{"$f":"IF('Hauptseite - main page'!I9<>\"\",'Hauptseite - main page'!I9,\"\")","v":""}]
[]
[null,{"$f":"IF('Bestellhilfe - ordering guide'!A27=\"\",\"\",'Bestellhilfe - ordering guide'!A27&CHAR(10)&CHAR(10))&IF('Bestellhilfe - ordering guide'!A28=\"\",\"\",'Bestellhilfe - ordering guide'!A28&CHAR(10)&CHAR(10))&IF('Bestellhilfe - ordering guide'!A29=\"\",\"\",'Bestellhilfe - ordering guide'!A29)","v":""},null,null,null,null,null,null,null,null,null,null,null,null,null,null,null,null,null,null,null,null,null,null,null,null,null,null,{"$f":"B18","v":""}]
[{"$f":"'Bestellhilfe - ordering guide'!A16","v":"Anzahl"},{"$f":"'Bestellhilfe - ordering guide'!O16","v":"kpl. Artikelnummer"},{"$f":"HLOOKUP('Bestellhilfe - ordering guide'!I3,'Bestellhilfe - ordering guide'!A234:G284,48,FALSE)","v":"Beschreibung"},null,null,null,null,null,null,null,null,null,null,null,null,null,null,null,null,null,null,null,null,null,null,null,null,null,null,null,null,null,null,{"$f":"IF(B18<>\"\",'Bestellhilfe - ordering guide'!Q16,\"\")","v":""}]
[{"$f":"IFERROR(INDEX('Bestellhilfe - ordering guide'!A:A,SMALL(IF('Bestellhilfe - ordering guide'!$A$1:$A$26<>\"\",ROW($1:$26)),ROW(A6))),\"\")","v":""},{"$f":"IFERROR(INDEX('Bestellhilfe - ordering guide'!O:O,SMALL(IF('Bestellhilfe - ordering guide'!$A$1:$A$26<>\"\",ROW($1:$26)),ROW(E6))),\"\")","v":""},{"$f":"IFERROR(INDEX('Bestellhilfe - ordering guide'!AP:AP,SMALL(IF('Bestellhilfe - ordering guide'!$A$1:$A$26<>\"\",ROW($1:$26)),ROW(E6))),\"\")","v":""},null,{"$f":"IF(AND(A20=\"\",B20=\"\",C20=\"\"),\"leer\",\"voll\")","v":"leer"},null,null,null,null,null,null,null,null,null,null,null,null,null,null,null,null,null,null,null,null,null," ",null,null,null,null,null,null,{"$f":"IFERROR(INDEX('Bestellhilfe - ordering guide'!Q:Q,SMALL(IF('Bestellhilfe - ordering guide'!$A$1:$A$26<>\"\",ROW($1:$26)),ROW(E6))),\"\")","v":""}]
{"$rows_left_out":12}
{"sheet":"Überblick - overview","index":3,"n_rows":309,"n_cols":13,"rows_kept":309,"cut":false,"hidden":true,"merged":[[174,7,176,7],[178,7,180,7],[182,7,184,7],[186,7,188,7],[142,7,144,7],[146,7,148,7],[150,7,152,7],[154,7,156,7],[158,7,160,7],[162,7,164,7],[142,5,144,5],[146,5,148,5],[150,5,152,5],[166,7,168,7],[170,7,172,7],[178,5,180,5],[182,5,184,5],[186,5,188,5],[154,5,156,5],[158,5,160,5],[162,5,164,5],[166,5,168,5],[170,5,172,5],[174,5,176,5],[178,0,188,0],[142,0,152,0],[154,0,164,0],[166,0,176,0],[40,0,44,0],[52,0,56,0],[46,0,50,0],[1,9,1,12],[2,0,2,8],[7,0,7,7],[7,9,7,13],[10,0,14,0],[10,2,11,2],[16,0,20,0],[28,0,32,0],[34,0,38,0],[10,9,11,9],[13,9,14,9],[16,9,17,9],[19,9,20,9],[16,2,17,2],[19,2,20,2],[22,0,26,0],[22,2,23,2],[22,9,23,9],[34,9,44,9],[52,2,53,2],[55,2,56,2],[28,2,29,2],[31,2,32,2],[34,2,35,2],[40,2,41,2],[43,2,44,2],[46,2,47,2],[49,2,50,2],[37,2,38,2]]}
[]
[]
[{"$f":"HLOOKUP($K$3,A256:G263,2,0)","v":"Gesamtüberblick - SmartHandle AX (SH2)"},null,null,null,null,null,null,null,null,null,{"$f":"'Hauptseite - main page'!G3","v":"Deutsch"}]
[null,null,null,null,null,null,null,null,null,"  "]
[]
[]
[]
[{"$f":"HLOOKUP($K$3,A256:G263,3,0)","v":"SmartHandle Varianten"},null,null,null,null,null,null,null,null,{"$f":"HLOOKUP($K$3,A256:G263,4,0)","v":"Drückervarianten"}]
[]
[]
[{"$f":"'Bestellhilfe - ordering guide'!$A$44","v":"(A0) - Europrofil\n- stehende Montage"},null,{"$f":"'Bestellhilfe - ordering guide'!$E$6","v":"Außenseite"},null,{"$f":"$K$265","v":"ODER"},null,{"$f":"$K$265","v":"ODER"},null,null,"A"]
[null,null,null,{"$f":"'Bestellhilfe - ordering guide'!$J$51","v":"ohne Rosette (0)"},null,{"$f":"'Bestellhilfe - ordering guide'!$J$52","v":"ohne Schließzylinder-Öffnung (1)"},null,{"$f":"'Bestellhilfe - ordering guide'!$J$53","v":"mit Schließzylinder-Öffnung (2)"}]
[]
[null,null,{"$f":"'Bestellhilfe - ordering guide'!$F$6","v":"Innenseite"},null,{"$f":"$K$265","v":"ODER"},null,{"$f":"$K$265","v":"ODER"},null,null,"B"]
[null,null,null,{"$f":"'Bestellhilfe - ordering guide'!$J$51","v":"ohne Rosette (0)"},null,{"$f":"'Bestellhilfe - ordering guide'!$J$52","v":"ohne Schließzylinder-Öffnung (1)"},null,{"$f":"'Bestellhilfe - ordering guide'!$J$53","v":"mit Schließzylinder-Öffnung (2)"}]
[]
[{"$f":"K266","v":"Europrofil\n- hängende Montage\n [70-79 mm] - (A1) & \n[70-110 mm] - (A2)"},null,{"$f":"'Bestellhilfe - ordering guide'!$E$6","v":"Außenseite"},null,{"$f":"$K$265","v":"ODER"},null,null,null,null,"C"]
[null,null,null,{"$f":"'Bestellhilfe - ordering guide'!$J$51&CHAR(10)&'Bestellhilfe - ordering guide'!$I$353","v":"ohne Rosette (0)\n[ (A1) Entfernung 70-79 mm ]"},null,{"$f":"'Bestellhilfe - ordering guide'!$J$51&CHAR(10)&'Bestellhilfe - ordering guide'!$I$354","v":"ohne Rosette (0)\n[ (A2) Entfernung 70-110 mm ]"}]
[]
[null,null,{"$f":"'Bestellhilfe - ordering guide'!$F$6","v":"Innenseite"},null,{"$f":"$K$265","v":"ODER"},null,{"$f":"$K$265","v":"ODER"},null,null,"D"]
{"$rows_left_out":290}
{"sheet":"Tabelle1","index":4,"n_rows":0,"n_cols":0,"rows_kept":0,"cut":false,"hidden":true,"merged":[]}

{"sheet":"Comments","index":5,"n_rows":29,"n_cols":10,"rows_kept":29,"cut":false,"hidden":true,"merged":[]}
[" ","Deutsch","English","Français","Italiano","Nederlands","Dansk","Svenska"]
["Produktname","System 3060 (SV-S2)\nMobile Key (MK-S2)","System 3060 (SV-S2)\nMobile Key (MK-S2)","noch zu übersetzen","noch zu übersetzen","noch zu übersetzen","System 3060 (SV-S2)\nMobile Key (MK-S2)"]
["Profil","Europrofil\nScandinavian Oval","Europrofile\nScandinavian Oval","Profil européen\nOvale scandinave","profilo europeo\nScandinavian Oval","Euro profiel\nScandinavian Oval","Europrofil\nScandinavisk Oval"]
["Montageform","stehende Montage\nhängende Montage (70-79 mm)\nhängende Montage (70-94 mm)","noch zu übersetzen","noch zu übersetzen","noch zu übersetzen","noch zu übersetzen","Stående Montage\nHængende Montage (70-79 mm)\nHængende Montage (70-94 mm)"]
["Außenrosette","ohne Rosette (0)\nohne Schließzylinderöffnung (1)\nmit Schließzylinderöffnung (2)","noch zu übersetzen",null,null,null,"Uden roset (0)\nUden hul til cylinder (1)\nMed hul til cylinder (2)"]
["Innenrosette","ohne Rosette (0)\nohne Schließzylinderöffnung (1)\nmit Schließzylinderöffnung (2)","MO = Mechanical Override\n\nblind (without MO)\nblind on one side / MO on the other side\nMO","noch zu übersetzen","noch zu übersetzen","noch zu übersetzen","Uden roset (0)\nUden hul til cylinder (1)\nMed hul til cylinder (2)"]
["Drücker außen","0 = ohne Drücker\nA = L-Form rund\nB = L-Form Gehrung\nC = U-Form rund\nD = U-Form Gehrung","0 = without handle\nA = L-shape curved\nB = L-shape mitre\nC = U-shape curved\nD = U-shape mitre","0 = ???\nA = forme en L arrondie\nB =  forme en L rectangulaire\nC = forme en U arrondie\nD = forme en U rectangulaire","0 = ???\nA = forma a L curvata tondeggiante\nB = forma a L piegata ad angolo retto\nC = forma a U curvata tondeggiante\nD = forma a U piegata ad angolo retto","0 = ???\nA = L-vorm rond gebogen\nB =  L-vorm verstek\nC = U-vorm rond gebogen\nD = U-vorm verstek","0 = Uden dørgreb\nA = L-formet greb buet\nB = L-formet greb vinkelret\nC = U-formet greb buet\nD = U-formet greb vinkelret"]
["Drücker innen","0 = ohne Drücker\nA = L-Form rund\nB = L-Form Gehrung\nC = U-Form rund\nD = U-Form Gehrung","0 = without handle\nA = L-shape curved\nB = L-shape mitre\nC = U-shape curved\nD = U-shape mitre","0 = ???\nA = forme en L arrondie\nB =  forme en L rectangulaire\nC = forme en U arrondie\nD = forme en U rectangulaire","0 = ???\nA = forma a L curvata tondeggiante\nB = forma a L piegata ad angolo retto\nC = forma a U curvata tondeggiante\nD = forma a U piegata ad angolo retto","0 = ???\nA = L-vorm rond gebogen\nB =  L-vorm verstek\nC = U-vorm rond gebogen\nD = U-vorm verstek","0 = Uden dørgreb\nA = L-formet greb buet\nB = L-formet greb vinkelret\nC = U-formet greb buet\nD = U-formet greb vinkelret"]
["Oberfläche","1 = silber / schwarz\n2 = silber / weiß","noch zu übersetzen","noch zu übersetzen","noch zu übersetzen","noch zu übersetzen","1 = Stål / sort\n2 = Stål / hvid"]
["Türdicke","S = 38-60 mm\nM = 59-80 mm\nL = 79-100 mm\nX = 100-200 mm","S = 38-60 mm\nM = 59-80 mm\nL = 79-100 mm\nX = 100-200 mm","S = 38-60 mm\nM = 59-80 mm\nL = 79-100 mm\nX = 100-200 mm","S = 38-60 mm\nM = 59-80 mm\nL = 79-100 mm\nX = 100-200 mm","S = 38-60 mm\nM = 59-80 mm\nL = 79-100 mm\nX = 100-200 mm","S = 38-60 mm\nM = 59-80 mm\nL = 79-100 mm\nX = 100-200 mm"]
["Vierkant","07 = 7 mm\n08 = 8 mm\n09 = 9 mm\n10 = 10 mm","07 = 7 mm\n08 = 8 mm\n09 = 9 mm\n10 = 10 mm","07 = 7 mm\n08 = 8 mm\n09 = 9 mm\n10 = 10 mm","07 = 7 mm\n08 = 8 mm\n09 = 9 mm\n10 = 10 mm","07 = 7 mm\n08 = 8 mm\n09 = 9 mm\n10 = 10 mm","07 = 7 mm\n08 = 8 mm\n09 = 9 mm\n10 = 10 mm"]
["Lesetechnik","A = Aktiv\nM = Mifare\nAM = Hybrid","A = Active\nM = Mifare\nAM = Hybrid","noch zu übersetzen","noch zu übersetzen","noch zu übersetzen","A = Aktiv\nM = MiFare\nAM = Hybrid"]
["Optionen","ZK = Zutrittskontrolle\nFH = zugelassen für FH Türen","ZK = Access control / time zone control\nFH = approved for fire resistant doors","ZK = contrôle des accès / contrôle des \nzones horaires\nFH = ???","ZK = controllo degli accessi / gestione delle fasce orarie\nFH = ???","ZK = Versie met toegangscontrole / tijdzonesturing\nFH = ???","ZK = Tid og log\nFH = Godkendt til branddøre EN???"]
[]
["Änderung (Brand-)Schutz","Bei Änderung dieser Zelle werden die Eingaben zu \"Profil\", \"Außenrosette\", \"Innenrosette\", \"Drücker außen\", \"Drücker innen\",\"Türdicke\" und \"Vierkant\" gelöscht.","Changes to this text field result in a resetting of \"profile\", \"rosette on the outside\", \"rosette on the inside\", \"handle outside\", \"handle inside\",  \"door thickness\" and \"spindle quare\".","Si vous changez cette ligne, vos indications relatives à \"le profil\", \"la  rosette extérieure\", \"la  rosette intérieure\", \"la béquille extérieure\",  \"la béquille intérieure\", \"Epaisseur de porte\" et \"Carré\" sont annulées.","Una modifica del presente campo comporta la cancellazione dei dati relativi al codice del profilo, rosetta esterna ed interna, maniglia esterna, maniglia interna, spessore porta e quadro maniglia.","Wijzigingen in dit tekstveld resulteren in een reset van profiel, de buiten en binnen rozet, deurkruk type buiten, deurkruk type binnen, deurdikte en Vierkant stift.","Ændringer til dette felt vil nulstille felterne \"Profil\", “Udvendig roset”, “Indvendig roset”, \"Udvendigt håndtag\", \"Indvendigt håndtag\", \"dørtykkelse\" og \"Firkant\".","Ändringar i detta textfält resulterar i återställning av \"profil\", \"rosett på utsidan\", \"rosett på insidan\", \"handtag utsida\", \"handtag insida\", \"dörrtjocklek\" och \"fyrkant\".",null,{"$f":"HLOOKUP('Hauptseite - main page'!$G$3,Comments!$B$1:$H$29,15,0)","v":"Bei Änderung dieser Zelle werden die Eingaben zu \"Profil\", \"Außenrosette\", \"Innenrosette\", \"Drücker außen\", \"Drücker innen\",\"Türdicke\" und \"Vierkant\" gelöscht."}]
["Änderung Profil","Bei Änderung dieser Zelle werden die Eingaben zu \"Außenrosette\", \"Innenrosette\", \"Drücker außen\", \"Drücker innen\",\"Türdicke\" und \"Vierkant\" gelöscht.","Changes to this text field result in a resetting of \"rosette on the outside\", \"rosette on the inside\", \"handle outside\", \"handle inside\",  \"door thickness\" and \"spindle quare\".","Si vous changez cette ligne, vos indications relatives à \"la  rosette extérieure\", \"la  rosette intérieure\", \"la béquille extérieure\",  \"la béquille intérieure\", \"Epaisseur de porte\" et \"Carré\" sont annulées.","Una modifica del presente campo comporta la cancellazione dei dati relativi alla rosetta esterna ed interna, maniglia esterna, maniglia interna, spessore porta ed quadro maniglia.","Wijzigingen in dit tekstveld resulteren in een reset van de buiten en binnen rozet, deurkruk type buiten, deurkruk type binnen, deurdikte en Vierkant stift.","Ændringer til dette felt vil nulstille felterne “Udvendig roset”, “Indvendig roset”, \"Udvendigt håndtag\", \"Indvendigt håndtag\", \"dørtykkelse\" og \"Firkant\".","Ändringar i detta textfält resulterar i återställning av \"rosett på utsidan\", \"rosett på insidan\", \"handtag utsida\", \"handtag insida\", \"dörrtjocklek\" och \"fyrkant\".",null,{"$f":"HLOOKUP('Hauptseite - main page'!$G$3,Comments!$B$1:$H$29,16,0)","v":"Bei Änderung dieser Zelle werden die Eingaben zu \"Außenrosette\", \"Innenrosette\", \"Drücker außen\", \"Drücker innen\",\"Türdicke\" und \"Vierkant\" gelöscht."}]
["Änderung Version","Bei Änderung dieser Zelle werden die Eingaben zur \"Außenrosette\" gelöscht.","Changes to this text field will result in a resetting of \"rosette on the outside\".","En cas de modifications dans cette cellule, les données concernant la \"technique de lecture\" seront supprimées.","In caso di cambio del testo di questa cella, il contenuto della cella \"tecnologia di lettura\" verrà cancellato","In geval van wijzigingen in dit tekstveld zal de \"leestechniek\" worden gewist.","Ændringer til dette felt vil nulstille felterne “Udvendig roset”","noch zu übersetzen",null,{"$f":"HLOOKUP('Hauptseite - main page'!$G$3,Comments!$B$1:$H$29,17,0)","v":"Bei Änderung dieser Zelle werden die Eingaben zur \"Außenrosette\" gelöscht."}]
[]
[null,"Türdicke (mm)","Door Thickness (mm)","Epaisseur de porte (mm)"]
[]
{"$rows_left_out":10}
{"sheet":"Bilder","index":6,"n_rows":36,"n_cols":27,"rows_kept":36,"cut":false,"hidden":true,"merged":[]}
["Bemaßung","Deutsch","English","Français","Italiano","Nederlands"]
[]
[]
[]
[]
["Drücker","A.","B.","C.","D.","E.","F."]
[]
[]
[]
[]
[]
[]
[]
["Einbinden von Fotos:","Fotos in Zelle unten einfügen mit \"einfügen als Bitmap"]
[null,"Markieren von A24 bis H24 --> STRG + Shift + F3 --> Namen erstellen aus den Werten aus \"linker Spalte\""]
[null,"Markieren von B24 bis H25 --> STRG + Shift + F3 --> Namen erstellen aus den Werten aus \"oberster Zeile\""]
[]
[]
[]
[]
{"$rows_left_out":17}
{"sheet":"Tabelle2","index":7,"n_rows":45,"n_cols":6,"rows_kept":45,"cut":false,"hidden":true,"merged":[]}
["Vierkant"]
[]
[]
[null,"07","08","F8","F9",10]
["A0","x","x","x","x","x"]
["A1","x","x","x","x","x"]
["A2","x","x","x","x","x"]
["B0",null,"x","x","x","x"]
["B1",null,"x","x","x","x"]
["B2",null,"x","x","x","x"]
["C0","x","x","x","x","x"]
["C1","x","x","x","x","x"]
["D0",null,"x","x","x","x"]
["D1",null,"x","x","x","x"]
["E0",null,"x","x","x"]
["E1",null,"x","x","x"]
["E2",null,"x","x","x"]
["F0"]
["F1"]
["G0"]
{"$rows_left_out":25}