{"text_format":"1","workbook":"xlsx","n_sheets":12,"sheets":["Hauptseite - main page","Bilder SH-Cover für Anzeige","Bestellhilfe SmartHandles","SmartHandle Cover","Comments","Bilder","Bilder SH-Cover sortiert","Zusammenfassung - summary","Hilfstabelle für Zus.fass.","Langtext_Cover_Übers.","Bilder für Rückw.suche","Tabelle1"],"not_rendered":{"charts":0,"images":109,"macros":1,"external_links":4,"defined_names":173,"comments":2,"pivot_tables":0},"unopened":[],"bounds":{"document_bytes":16777216,"sheet_cells":100000,"rows_first":2000,"rows_last":500,"rows_between":2000,"halvings":0,"cell_chars":16384,"cell_head_chars":4096},"cells_cut":0,"cells_raw":0,"read":"whole","date_system":"1900"}

{"sheet":"Hauptseite - main page","index":0,"n_rows":228,"n_cols":16,"rows_kept":228,"cut":false,"hidden":false,"merged":[[1,5,1,8],[2,6,2,7],[3,5,3,8],[7,2,7,6],[8,2,8,6],[10,2,10,6],[11,2,11,6],[13,2,13,6],[61,9,61,10],[61,5,61,7],[61,0,61,2],[49,12,49,13],[23,6,23,8],[23,9,23,11],[26,8,29,10],[49,0,49,2],[49,5,49,7],[49,9,49,10]]}
[]
["SmartHandle -",null,null,null,null,"Sprache / language / langue / lingua / taal / sprog"]
[{"$f":"HLOOKUP(G3,A207:F227,13,0)","v":"Bestell-Leitfaden"},null,null,null,null,null,"Deutsch"]
[null,null,null,null,null,{"$f":"K223","v":"*** Bitte Makros aktivieren ***"}]
[]
[]
[]
[{"$f":"'Bestellhilfe SmartHandles'!A12","v":"Kundennummer"},null,null,null,null,null,null,null,{"$f":"K222","v":"abweichende Lieferanschrift"}]
{"$rows_left_out":221}
{"sheet":"Bilder SH-Cover für Anzeige","index":1,"n_rows":38,"n_cols":5,"rows_kept":38,"cut":false,"hidden":true,"merged":[]}
["schmal","Außenseite",null,null,"Innenseite"]
[null,"SH.CS",null,null,"SH.CS"]
[null,"SH.CSP",null,null,"SH.CS"]
[null,"SH.CS.XX",null,null,"SH.CS.XX"]
[null,"SH.CSP.XX",null,null,"SH.CS.XX"]
[null,"SH.CS.SO",null,null,"SH.CS.SO"]
[null,"SH.CSP.SO",null,null,"SH.CS.SO"]
[null,"SH.CS.SO.105",null,null,"SH.CS.SO.105"]
{"$rows_left_out":31}
{"sheet":"Bestellhilfe SmartHandles","index":2,"n_rows":648,"n_cols":44,"rows_kept":648,"cut":false,"hidden":true,"merged":[[28,0,28,16],[8,11,8,15],[4,0,4,1],[13,1,13,2],[25,0,25,15],[9,11,9,15],[11,11,11,13],[13,4,13,5],[11,14,11,15],[6,1,6,2],[4,3,4,4],[13,6,13,9],[15,4,15,5],[4,17,4,18],[1,7,1,10],[7,3,7,4],[11,6,11,7],[5,13,5,15],[3,7,3,10],[4,8,4,10],[11,4,11,5],[6,8,6,10]]}
[]
[]
[{"$f":"HLOOKUP($I$3,A149:E170,22,0)","v":"Bestellhilfe Digitales SmartHandle 3062"},null,null,null,null,null,null,null,{"$f":"'Hauptseite - main page'!G3","v":"Deutsch"}]
[]
[{"$f":"HLOOKUP($I$3,A149:E171,23,0)","v":"Europrofil / Swiss Round / British Oval"},null,null,{"$f":"HLOOKUP($I$3,A149:E190,42,0)","v":"Scandinavian Oval"},null,null,null,null,{"$f":"HLOOKUP($I$3,A149:E172,24,0)","v":"Drückervariante auswählen"},null,null,null,null,null,null,null,null,"Stand: 11 / 2018"]
[null,null,null,null,null,null,null,null,null,"C."]
[{"$f":"I3","v":"Deutsch"},null,null,null,null,null,null,null,{"$f":"VLOOKUP(J6,Comments!H29:I36,2,FALSE)","v":"U-Form rund"}]
[]
{"$rows_left_out":641}
{"sheet":"SmartHandle Cover","index":3,"n_rows":111,"n_cols":48,"rows_kept":111,"cut":false,"hidden":true,"merged":[[15,3,15,4],[14,4,14,5],[1,3,1,5],[12,0,12,5],[6,0,7,0],[6,1,7,1],[6,2,7,2],[6,3,7,3],[6,4,6,5],[9,4,9,5],[3,3,3,5]]}
[]
[]
[{"$f":"HLOOKUP($E$3,$A$58:$F$110,2,0)","v":"Bestellhilfe für SmartHandle Cover"},null,null,null,{"$f":"'Hauptseite - main page'!G3","v":"Deutsch"}]
[]
[]
[]
[{"$f":"HLOOKUP($E$3,$A$58:$F$110,3,0)","v":"Profil"},{"$f":"HLOOKUP($E$3,$A$58:$F$110,4,0)","v":"Aktiv / Passiv (Hybrid)"},{"$f":"HLOOKUP($E$3,$A$58:$F$110,5,0)","v":"Mechanical Override Ja/Nein"},{"$f":"HLOOKUP($E$3,$A$58:$F$110,6,0)","v":"schmal / breit"},{"$f":"HLOOKUP($E$3,$A$58:$F$110,7,0)","v":"Verkaufs-Artikelnummer"}]
[null,null,null,null,{"$f":"HLOOKUP($E$3,$A$58:$F$110,8,0)","v":"für Außenseite"},{"$f":"HLOOKUP($E$3,$A$58:$F$110,9,0)","v":"für Innenseite"}]
{"$rows_left_out":104}
{"sheet":"Comments","index":4,"n_rows":36,"n_cols":11,"rows_kept":36,"cut":false,"hidden":true,"merged":[]}
["Sprache","Deutsch","English","Français","Italiano","Nederlands",null,null,{"$f":"'Bestellhilfe SmartHandles'!I3","v":"Deutsch"}]
["SmartHandle Typ","Standard SmartHandle (ohne Door Monitoring)\nDoor Monitoring (interne Sensorik)\nDoor Monitoring  (Schlosssensorik)","Standard SmartHandle (without Door Monitoring)\nDoor Monitoring (internal sensors)\nDoor Monitoring (sensor locks)","SmartHandle standard (sans Door Monitoring)\nDoor Monitoring (capteurs internes)\nDoor Monitoring (capteurs externes)","SmartHandle standard (Senza DoorMonitoring)\nDoor Monitoring (sensore interno)\nDoor Monitoring (sensore esterno)","Standaard SmartHandle (zonder deurstand signalering)\nDeurstand signalering (interne sensors)\nDeurstand signalering (externe sensors)"]
["Profilname","Europrofil ohne Lochung für Profilzylinder (SHA)\nSwiss Round ohne Lochung für Profilzylinder (SHA)\nBritish Oval ohne Lochung für Profilzylinder (SHA)\nScandinavian Oval ohne Lochung für Profilzylinder (SHB)\nEuroprofil mit Lochung für Profilzylinder - MO (SHC)\nSwiss Round mit Lochung für Profilzylinder - MO (SHD)\nScandinavian Oval mit Lochung für Profilzylinder - MO (SHE)\nEuroprofil mit MO - Rosettenmontage (SHF)\nSwiss Round mit MO - Rosettenmontage (SHG)\nEuroprofil mit MO - für Rohrrahmentüren (SHH)\nSwiss Round mit MO - für Rohrrahmentüren (SHI)\n","Europrofile without Mechanical Override (SHA)\nSwiss Round without Mechanical Override (SHA)\nBritish Oval without Mechanical Override (SHA)\nScandinavian Oval without Mechanical Override (SHB)\nEuroprofil with Mechanical Override - MO (SHC)\nSwiss Round with Mechanical Override - MO (SHD)\nScandinavian Oval with Mechanical Override - MO (SHE)\nEuro profile with Mechanical Override (MO) - rosette mounting (SHF)\nSwiss Round with Mechanical Override (MO) - rosette mounting (SHG)\nEuro profile with Mechanical Override (MO) - for tabular frame doors (SHH)\nSwiss Round with Mechanical Override (MO) - for tabular frame doors (SHI)","Profil européen sans verrouillage mécanique (SHA)\nProfil suisse sans verrouillage mécanique (SHA)\nOvale britannique sans verrouillage mécanique (SHA)\nOvale scandinave sans verrouillage mécanique (SHB)\nprofil européen avec Verrouillage mécanique - VM (SHC)     \nprofil suisse avec Verrouillage mécanique - VM (SHD)\nOvale scandinave avec Verrouillage mécanique - VM (SHE)","profilo europeo senza Mechanical Override (SHA)\ntondo svizzero senza Mechanical Override (SHA)\nBritish Oval senza Mechanical Override (SHA)\nScandinavian Oval senza Mechanical Override (SHB)\nprofilo europeo con mechanical override - MO (SHC)\ntondo svizzero con mechanical override - MO (SHD)\nScandinavian Oval con Mechanical Override - MO (SHE)","Euro profiel zonder Mechanical Override (SHA)\nSwiss Round zonder Mechanical Override (SHA)\nBritish Oval zonder Mechanical Override (SHA)\nScandinavian Oval zonder Mechanical Override (SHB)\nEuro profiel met mechanical Override - MO (SHC)\nSwiss round met mechanical Override - MO (SHD)\nScandinavian Oval met Mechanical Override - MO (SHE)"]
["Profil","A = \nEuroprofil, \nSwiss Round,\nBritish Oval\n\nB =\nScandinavian Oval\n\nC =\nEuroprofil mit Mechanical Override (MO)\n\nD =\nSwiss Round mit Mechanical Override (MO)\n\nE =\nScandinavian Oval mit Mechanical Override (MO)","A = \nEuroprofile, \nSwiss Round,\nBritish Oval\n\nB =\nScandinavian Oval\n\nC =\nEuroprofile with Mechanical Override (MO)\n\nD =\nSwiss Round with Mechanical Override (MO)\n\nE =\nScandinavian Oval with Mechanical Override (MO)","A = \nprofil européen, \nprofil suisse,\novale britannique\n\nB =\nOvale scandinave\n\nC =\nprofil européen avec Verrouillage mécanique (VM)\n\nD =\nprofil suisse avec Verrouillage mécanique (VM)\n\nE =\nOvale scandinave avec verrouillage mécanique (VM)","Door Monitoring (sensore esterno)","A = \nEuro profiel, \nSwiss Round,\nBritish Oval\n\nB =\nScandinavian Oval\n\nC =\nEuro profiel met mechanical Override (MO)\n\nD =\nSwiss Round met mechanical Override (MO)\n\nE =\nScandinavian Oval met Mechanical Override (MO)"]
["Türdicke","für Profile (außer SO) / Standard:\nS = 39-60 mm\nM = 59-80 mm\nL = 79-100 mm\n\nfür Scandinavian Oval Profil / Standard:\nS = 33-50 mm\nM = 49-70 mm\nL = 69-94 mm\n\nfür Scandinavian Oval Profil mit Option DP (Bohrschutz):\nS = 30-47 mm\nM = 46-67 mm\nL = 66-91 mm\n\nSKG & PAS24:\nS = 32-50 mm\nM = 50-70 mm\nL = 70-90 mm\n\nRosettenmontage:\nS = 40-53 mm\nM = 52-73 mm\nL = 72-93 mm\n\nRohrrahmen-Montage:\nS = 40-53 mm\nM = 52-72 mm\nL = 71-91 mm","for profiles (except SO) / Standard:\nS = 39-60 mm\nM = 59-80 mm\nL = 79-100 mm\n\nfor SO lock type: / Standard:\nS = 33-50 mm\nM = 49-70 mm\nL = 69-94 mm\n\nfor SO lock type with option DP (drilling protection):\nS = 30-47 mm\nM = 46-67 mm\nL = 66-91 mm\n\nSKG & PAS24:\nS = 32-50 mm\nM = 50-70 mm\nL = 70-90 mm\n\nRosette mounting:\nS = 40-53 mm\nM = 52-73 mm\nL = 72-93 mm\n\nMounting on tabular frame doors:\nS = 40-53 mm\nM = 52-72 mm\nL = 71-91 mm","pour type de profil (sans SO) /Standard:\nS = 39-60 mm\nM = 59-80 mm\nL = 79-100 mm\n\npour type de serrure SO (Ovale scandinave) / Standard:\nS = 33-50 mm\nM = 49-70 mm\nL = 69-94 mm\n\npour type de serrure SO (Ovale scandinave) avec option DP (protection anti-perçage):\nS = 30-47 mm\nM = 46-67 mm\nL = 66-91 mm\n\nSKG & PAS24:\nS = 32-50 mm\nM = 50-70 mm\nL = 70-90 mm","for profilo (escluso SO) / Standard:\nS = 39-60 mm\nM = 59-80 mm\nL = 79-100 mm\n\nfor Scandinavian Oval profilo / Standard:\nS = 33-50 mm\nM = 49-70 mm\nL = 69-94 mm\n\nfor Scandinavian Oval profilo con option DP (protezione trapanatura):\nS = 30-47 mm\nM = 46-67 mm\nL = 66-91 mm\n\nSKG & PAS24:\nS = 32-50 mm\nM = 50-70 mm\nL = 70-90 mm","voor profiel (behalve SO) / Standard:\nS = 39-60 mm\nM = 59-80 mm\nL = 79-100 mm\n\nvoor Scandinavian Oval profiel: / Standard:\nS = 33-50 mm\nM = 49-70 mm\nL = 69-94 mm\n\nvoor Scandinavian Oval profiel met option DP (drilling protection):\nS = 30-47 mm\nM = 46-67 mm\nL = 66-91 mm\n\nSKG & PAS24:\nS = 32-50 mm\nM = 50-70 mm\nL = 70-90 mm",null,null,{"$f":"HLOOKUP(I1,B1:F5,5,0)","v":"für Profile (außer SO) / Standard:\nS = 39-60 mm\nM = 59-80 mm\nL = 79-100 mm\n\nfür Scandinavian Oval Profil / Standard:\nS = 33-50 mm\nM = 49-70 mm\nL = 69-94 mm\n\nfür Scandinavian Oval Profil mit Option DP (Bohrschutz):\nS = 30-47 mm\nM = 46-67 mm\nL = 66-91 mm\n\nSKG & PAS24:\nS = 32-50 mm\nM = 50-70 mm\nL = 70-90 mm\n\nRosettenmontage:\nS = 40-53 mm\nM = 52-73 mm\nL = 72-93 mm\n\nRohrrahmen-Montage:\nS = 40-53 mm\nM = 52-72 mm\nL = 71-91 mm"},null,"alle Profile / all profiles (außer SO / except SO) --> Standard:\nS = 39-59 mm\nM = 60-79 mm\nL = 80-100 mm\n\nScandinavian Oval Profil(e) --> Standard:\nS = 33-53 mm\nM = 54-73 mm\nL = 74-94 mm\n\nScandinavian Oval Profil(e) mit/with Option DP (Bohrschutz / drilling protection):\nS = 30-50 mm\nM = 51-70 mm\nL = 71-91 mm\n\nSKG & PAS24:\nS = 32-49 mm\nM = 50-69 mm\nL = 70-90 mm"]
["Vierkant","07 = 7 mm\n08 = 8 mm\nF8 = 8 mm (feuerhemmend, nur für Europrofil)\n09 = 9 mm\n10 = 10 mm","07 = 7 mm\n08 = 8 mm\nF8 = 8 mm (Fire-retardant,for Europrofile only)\n09 = 9 mm\n10 = 10 mm","07 = 7 mm\n08 = 8 mm\nF8 = 8 mm (coupe-feu, seulement pour profil européen)\n09 = 9 mm\n10 = 10 mm","07 = 7 mm\n08 = 8 mm\nF8 = 8 mm (Versione ignifuga, solo per profilo europeo)\n09 = 9 mm\n10 = 10 mm","07 = 7 mm\n08 = 8 mm\nF8 = 8 mm (Brandwerende versie, alleen voor Euro profiel)\n09 = 9 mm\n10 = 10 mm"]
["Befestigung","A = SnapIn schmal (41mm)\nB = SnapIn breit (53mm)\nC = Konvent. Befestigung schmal (41mm)\nD = Konvent. Befestigung breit (53mm)\nE = Konvent. Befestigung MO - innen und außen Ausschnitt - schmal (41mm)\nF = Konvent. Befestigung MO - innen und außen Ausschnitt - breit (53mm)\nG = Konvent. Befestigung MO - innen blind, außen Ausschnitt - schmal (41mm)\nH = Konvent. Befestigung MO - innen blind, außen Ausschnitt - breit (53mm)\nI = Konvent. Befestigung MO - innen Ausschnitt, außen blind - schmal (41mm)\nJ = Konvent. Befestigung MO - innen Ausschnitt, außen blind - breit (53mm)\nK = Konvent. Befestigung MO - innen und außen blind - schmal (41mm)\nL = Konvent. Befestigung MO - innen und außen blind - breit (53mm)","A = SnapIn narrow (41mm)\nB = SnapIn wide (53mm)\nC = Conventional Fastening Narrow (41mm)\nD = Conventional Fastening Wide (53mm)\nE = Conventional Fastening MO - inside and outside cylinder recess - narrow (41mm)\nF = Conventional Fastening MO - inside and outside cylinder recess - wide (53mm)\nG = Conventional Fastening MO - inside blind, outside cylinder recess - narrow (41mm)\nH = Conventional Fastening MO - inside blind, outside cylinder recess - wide (53mm)\nI = Conventional Fastening MO - inside cylinder recess, outside blind - narrow (41mm)\nJ = Conventional Fastening MO - inside cylinder recess, outside blind - wide (53mm)\nK = Conventional Fastening MO - inside and outside blind - narrow (41mm)\nL = Conventional Fastening MO - inside and outside blind - wide (53mm)","A = SnapIn / étroit (41 mm)\nB = SnapIn / large (53 mm)\nC = Fixation conventionnelle / étroit (41 mm)\nD = Fixation conventionnelle / large (53 mm)\nE = Fixation conventionnelle VM – perçage à l’intérieur et à l’extérieur / étroit (41 mm)\nF = Fixation conventionnelle VM – perçage à l’intérieur et à l’extérieur / large (53 mm)\nG = Fixation conventionnelle VM – aucun perçage à l’intérieur/perçage à l’extérieur / étroit (41 mm)  \nH = Fixation conventionnelle VM – aucun perçage à l’intérieur/perçage à l’extérieur / large (53 mm)\nI = Fixation conventionnelle VM – perçage à l’intérieur/aucun perçage à l’extérieur / étroit (41 mm) \nJ = Fixation conventionnelle VM – perçage à l’intérieur/aucun perçage à l’extérieur / large (53 mm)\nK = Fixation conventionnelle VM – aucun perçage à l’intérieur et à l’extérieur / étroit (41 mm)  \nL = Fixation conventionnelle VM – aucun perçage à l’intérieur et à l’extérieur / large (53 mm)","A=SnapIn coprimaniglia stretto (41 mm)\nB=SnapIn coprimaniglia largo (53 mm)\nC = Fissaggio convenzionale coprimaniglia stretto (41 mm)\nD = Fissaggio convenzionale coprimaniglia largo (53 mm)\nE = Fissaggio convenzionale mO – interno ed esterno con incavo coprimaniglia stretto (41 mm)\nF = Fissaggio convenzionale mO – interno ed esterno con incavo coprimaniglia largo (53 mm)\nG = Fissaggio convenzionale mO – interno senza incavo/esterno con incavo coprimaniglia stretto (41 mm)   \nH = Fissaggio convenzionale mO – interno senza incavo/esterno con incavo coprimaniglia largo (53 mm)\nI = Fissaggio convenzionale mO – interno con incavo/esterno senza incavo coprimaniglia stretto (41 mm) \nJ = Fissaggio convenzionale mO – interno con incavo/esterno senza incavo coprimaniglia largo (53 mm)\nK = Fissaggio convenzionale mO –interno ed esterno senza incavo coprimaniglia stretto (41 mm)  \nL = Fissaggio convenzionale mO –interno ed esterno senza incavo coprimaniglia largo (53 mm)","A = SnapIn smal (41 mm)\nB = SnapIn breed (53 mm)\nC = Conventionele bevestiging smal (41 mm)\nD = Conventional bevestiging breed (53mm)\nE = Conventionele bevestiging MO – binnen en buiten uitsparing smal (41 mm)\nF = Conventionele bevestiging MO – binnen en buiten uitsparing breed (53 mm)\nG = Conventionele bevestiging MO – binnen blind/buiten uitsparing smal (41 mm)  \nH = Conventionele bevestiging MO – binnen blind/buiten uitsparing breed (53 mm)\nI = Conventionele bevestiging MO – binnen uitsparing/buiten blind smal (41 mm) \nJ = Conventionele bevestiging MO – binnen uitsparing/buiten blind breed (53 mm)\nK = Conventionele bevestiging MO – binnen en buiten blind smal (41 mm)  \nL = Conventionele bevestiging MO – binnen en buiten blind breed (53 mm)"]
["Entfernung","00 = Konventionelle Befestigung (Version: C, D, K, L)\n70 = 70 mm\n72 = 72 mm\n75 = 75 mm\n78 = 78 mm\n85 = 85 mm\n88 = 88 mm\n90 = 90 mm\n92 = 92 mm\n94 = 94 mm (nur für Swiss Round)\n96 = 96 mm (nur für Scandinavian Oval)\n05 = 105 mm (nur für Scandinavian Oval)","00 = Conventional Fastening (Version: C, D, K, L)\n70 = 70 mm\n72 = 72 mm\n75 = 75 mm\n78 = 78 mm\n85 = 85 mm\n88 = 88 mm\n90 = 90 mm\n92 = 92 mm\n94 = 94 mm (only for Swiss Round)\n96 = 96 mm (only for Scandinavian Oval) \n05 = 105 mm (only for Scandinavian Oval)","00 = Fixation conventionnelle  (Variante C, D, K, L)\n70 = 70 mm\n72 = 72 mm\n75 = 75 mm\n78 = 78 mm\n85 = 85 mm\n88 = 88 mm\n90 = 90 mm\n92 = 92 mm\n94 = 94 mm (seulement pour profil suisse)\n96 = 96 mm (seulement pour ovale scandinave)\n05 = 105 mm (seulement pour ovale scandinave)","00 =  fissaggio convenzionale versione C, D, K, L)\n70 = 70 mm\n72 = 72 mm\n75 = 75 mm\n78 = 78 mm\n85 = 85 mm\n88 = 88 mm\n90 = 90 mm\n92 = 92 mm\n94 = 94 mm (solo per tondo svizzero)\n96 = 96 mm (solo per Scandinavian Oval)\n05 = 105 mm (solo per Scandinavian Oval)","00 = conventionele bevestiging (versie C, D, K, L)\n70 = 70 mm\n72 = 72 mm\n75 = 75 mm\n78 = 78 mm\n85 = 85 mm\n88 = 88 mm\n90 = 90 mm\n92 = 92 mm\n94 = 94 mm (alleen voor Swiss round)\n96 = 96 mm (alleen voor Scandinavian Oval)\n05 = 105 mm (alleen voor Scandinavian Oval)"]
{"$rows_left_out":29}
{"sheet":"Bilder","index":5,"n_rows":29,"n_cols":14,"rows_kept":29,"cut":false,"hidden":true,"merged":[]}
["Bemaßung","Deutsch","English","Français","Italiano","Nederlands"]
[]
[]
[]
[]
["Drücker","A.","B.","C.","D.","E.","F."]
[]
[]
{"$rows_left_out":22}
{"sheet":"Bilder SH-Cover sortiert","index":6,"n_rows":20,"n_cols":12,"rows_kept":20,"cut":false,"hidden":true,"merged":[[0,0,1,0],[1,8,1,9],[1,11,1,12],[1,1,1,2],[1,4,1,5],[0,1,0,5],[0,8,0,12]]}
[null,{"$f":"HLOOKUP('SmartHandle Cover'!$E$3,'SmartHandle Cover'!$B$58:$F$87,23,0)","v":"schmal"},null,null,null,null,null,null,{"$f":"HLOOKUP('SmartHandle Cover'!$E$3,'SmartHandle Cover'!$B$58:$F$87,24,0)","v":"breit"}]
[null,{"$f":"HLOOKUP('SmartHandle Cover'!$E$3,'SmartHandle Cover'!$B$58:$F$87,8,0)","v":"für Außenseite"},null,null,{"$f":"HLOOKUP('SmartHandle Cover'!$E$3,'SmartHandle Cover'!$B$58:$F$87,9,0)","v":"für Innenseite"},null,null,null,{"$f":"HLOOKUP('SmartHandle Cover'!$E$3,'SmartHandle Cover'!$B$58:$F$87,8,0)","v":"für Außenseite"},null,null,{"$f":"HLOOKUP('SmartHandle Cover'!$E$3,'SmartHandle Cover'!$B$58:$F$87,9,0)","v":"für Innenseite"}]
[null,"SH.CS",null,null,"SH.CS",null,null,null,"SH.CB",null,null,"SH.CB"]
[null,"SH.CSP",null,null,"SH.CS",null,null,null,"SH.CBP",null,null,"SH.CB"]
[null,"SH.CS.X",null,null,"SH.CS.X",null,null,null,"SH.CB.X",null,null,"SH.CB.X"]
[null,"SH.CSP.X",null,null,"SH.CS.X",null,null,null,"SH.CBP.X",null,null,"SH.CB.X"]
[null,"SH.CS.SO",null,null,"SH.CS.SO",null,null,null,"SH.CB.SO",null,null,"SH.CB.SO"]
[null,"SH.CSP.SO",null,null,"SH.CS.SO",null,null,null,"SH.CBP.SO",null,null,"SH.CB.SO"]
{"$rows_left_out":13}
{"sheet":"Zusammenfassung - summary","index":7,"n_rows":74,"n_cols":40,"rows_kept":74,"cut":false,"hidden":true,"merged":[[22,0,22,2],[1,0,1,2],[6,0,6,1],[7,0,7,1],[9,0,9,1],[10,0,10,1],[12,0,12,1]]}
[]
[{"$f":"'Bestellhilfe SmartHandles'!J216","v":"Zusammenfassung der Bestellung"},null,null,null,null,{"$f":"'Hauptseite - main page'!G3","v":"Deutsch"}]
[]
[]
[]
[]
[{"$f":"'Hauptseite - main page'!A8","v":"Kundennummer"},null,{"$f":"IF('Hauptseite - main page'!C8<>\"\",'Hauptseite - main page'!C8,\"\")","v":""}]
[{"$f":"'Hauptseite - main page'!A9","v":"Kundenname"},null,{"$f":"IF('Hauptseite - main page'!C9<>\"\",'Hauptseite - main page'!C9,\"\")","v":""}]
{"$rows_left_out":67}
{"sheet":"Hilfstabelle für Zus.fass.","index":8,"n_rows":33,"n_cols":12,"rows_kept":33,"cut":false,"hidden":true,"merged":[]}
["Hilftabelle für Zusammenfassung"]
[]
["Menge","Artikelnummer","Beschreibung",null,null,null,null,null,null,null,"Artikeltyp","Zeile"]
[{"$f":"IF('Bestellhilfe SmartHandles'!A17<>\"\",'Bestellhilfe SmartHandles'!A17,\"\")","v":""},{"$f":"IF('Bestellhilfe SmartHandles'!Q17<>\"\",'Bestellhilfe SmartHandles'!Q17,\"\")","v":""},{"$f":"IF('Bestellhilfe SmartHandles'!AC17<>\"\",'Bestellhilfe SmartHandles'!AC17,\"\")","v":", (ohne Elektronik)"},null,null,null,null,null,null,{"$f":"IF(B4<>\"\",\"x\",\"\")","v":""},"SmartHandle",18]
[{"$f":"IF('Bestellhilfe SmartHandles'!A18<>\"\",'Bestellhilfe SmartHandles'!A18,\"\")","v":""},{"$f":"IF('Bestellhilfe SmartHandles'!Q18<>\"\",'Bestellhilfe SmartHandles'!Q18,\"\")","v":""},{"$f":"IF('Bestellhilfe SmartHandles'!AC18<>\"\",'Bestellhilfe SmartHandles'!AC18,\"\")","v":""},null,null,null,null,null,null,"","SmartHandle",19]
[{"$f":"IF('Bestellhilfe SmartHandles'!A19<>\"\",'Bestellhilfe SmartHandles'!A19,\"\")","v":""},{"$f":"IF('Bestellhilfe SmartHandles'!Q19<>\"\",'Bestellhilfe SmartHandles'!Q19,\"\")","v":""},{"$f":"IF('Bestellhilfe SmartHandles'!AC19<>\"\",'Bestellhilfe SmartHandles'!AC19,\"\")","v":""},null,null,null,null,null,null,"","SmartHandle",20]
[{"$f":"IF('Bestellhilfe SmartHandles'!A20<>\"\",'Bestellhilfe SmartHandles'!A20,\"\")","v":""},{"$f":"IF('Bestellhilfe SmartHandles'!Q20<>\"\",'Bestellhilfe SmartHandles'!Q20,\"\")","v":""},{"$f":"IF('Bestellhilfe SmartHandles'!AC20<>\"\",'Bestellhilfe SmartHandles'!AC20,\"\")","v":""},null,null,null,null,null,null,"","SmartHandle",21]
[{"$f":"IF('Bestellhilfe SmartHandles'!A21<>\"\",'Bestellhilfe SmartHandles'!A21,\"\")","v":""},{"$f":"IF('Bestellhilfe SmartHandles'!Q21<>\"\",'Bestellhilfe SmartHandles'!Q21,\"\")","v":""},{"$f":"IF('Bestellhilfe SmartHandles'!AC21<>\"\",'Bestellhilfe SmartHandles'!AC21,\"\")","v":""},null,null,null,null,null,null,"","SmartHandle",22]
{"$rows_left_out":26}
{"sheet":"Langtext_Cover_Übers.","index":9,"n_rows":40,"n_cols":9,"rows_kept":40,"cut":false,"hidden":true,"merged":[]}
["Artikelnummer",null,null,"Artikelnummer","Deutsch","English","Français","Italiano","Nederlands"]
["SH.CB",{"$f":"HLOOKUP('SmartHandle Cover'!$E$3,$D$1:$I$38,2)","v":"breites Cover / \nEuro-PZ"},null,"SH.CB","breites Cover / \nEuro-PZ","wide cover / \nEuro profile","plaque large  / profil européen","Cover larga /\nProfilo europeo","breed schild /\nEuro profiel"]
["SH.CB.SO",{"$f":"HLOOKUP('SmartHandle Cover'!$E$3,$D$1:$I$38,3)","v":"breites Cover / \nScandinavian Oval"},null,"SH.CB.SO","breites Cover / \nScandinavian Oval","wide cover / \nScandinavian Oval","plaque large  / profil scandinave ovale","Cover larga /\nOvale scandinavo","breed schild /\nScandinavian Oval"]
["SH.CB.SO.105",{"$f":"HLOOKUP('SmartHandle Cover'!$E$3,$D$1:$I$38,4)","v":"breites Cover / \nScandinavian Oval /\nmit Mechanical Override"},null,"SH.CB.SO.105","breites Cover / \nScandinavian Oval /\nmit Mechanical Override","wide cover / \nScandinavian Oval / \nwith mechanical override","plaque large / ovale scandinave / avec verrouillage mécanique","Cover larga /\nOvale Scnadinavo /\ncon override meccanico","breed schild /\nScandinavian Oval /\nmet Mechanical Override"]
["SH.CB.SR",{"$f":"HLOOKUP('SmartHandle Cover'!$E$3,$D$1:$I$38,5)","v":"breites Cover / \nSwiss Round"},null,"SH.CB.SR","breites Cover / \nSwiss Round","wide cover / \nSwiss Round","plaque large /suisse rond","Cover larga / \nTondo svizzero","breed schild /\nSwiss Round"]
["SH.CB.SR.A78",{"$f":"HLOOKUP('SmartHandle Cover'!$E$3,$D$1:$I$38,6)","v":"breites Cover / \nSwiss Round (Außenseite) /\nmit Mechanical Override"},null,"SH.CB.SR.A78","breites Cover / \nSwiss Round (Außenseite) /\nmit Mechanical Override","wide cover / \nSwiss Round (outside) / \nwith mechanical override","plaque large / suisse rond / avec verrouillage ménanique (extérieur)","Cover larga /\nTondo svizzero /\ncon override mecanico ( lato esterno )","breed schild /\nSwiss Round (buitenzijde) /\nmet Mechanical Override"]
["SH.CB.SR.I78",{"$f":"HLOOKUP('SmartHandle Cover'!$E$3,$D$1:$I$38,7)","v":"breites Cover / \nSwiss Round (Innenseite) /\nmit Mechanical Override"},null,"SH.CB.SR.I78","breites Cover / \nSwiss Round (Innenseite) /\nmit Mechanical Override","wide cover / \nSwiss Round (inside) / \nwith mechanical override ","plaque large / suisse rond / avec verrouillage ménanique (intérieur)","Cover larga /\nTondo svizzero /\ncon override mecanico ( lato interno )","breed schild /\nSwiss Round (binnenzijde) /\nmet Mechanical Override"]
["SH.CB.X",{"$f":"HLOOKUP('SmartHandle Cover'!$E$3,$D$1:$I$38,8)","v":"breites Cover / \nEuro-PZ / \nmit Mechanical Override"},null,"SH.CB.X","breites Cover / \nEuro-PZ / \nmit Mechanical Override","wide cover / \nEuro profile / \nwith mechanical override","plaque large / profil européen / avec verrouillage mécanique","Cover larga /\nProfilo europeo /\ncon override meccanico","breed schild /\nEuro profiel /\nmet Mechanical Override"]
{"$rows_left_out":33}
{"sheet":"Bilder für Rückw.suche","index":10,"n_rows":40,"n_cols":1,"rows_kept":40,"cut":false,"hidden":true,"merged":[]}
["Artikelnummer"]
["SH.CB"]
["SH.CB.SO"]
["SH.CB.SO.105"]
["SH.CB.SR"]
["SH.CB.SR.A78"]
["SH.CB.SR.I78"]
["SH.CB.X"]
{"$rows_left_out":33}
{"sheet":"Tabelle1","index":11,"n_rows":0,"n_cols":0,"rows_kept":0,"cut":false,"hidden":true,"merged":[]}